{"text_format":"2","workbook":"xlsx","n_sheets":5,"sheets":["BUD","CAT","CPL","VAR","Exec Summary"],"not_rendered":{"charts":0,"images":0,"macros":0,"external_links":0,"defined_names":4,"comments":0,"pivot_tables":0},"unopened":[],"bounds":{"document_bytes":16777216,"sheet_cells":100000,"run_cost":"one","rows_first":2000,"rows_last":500,"rows_between":2000,"halvings":0,"cell_chars":16384,"cell_head_chars":4096},"cells_cut":0,"cells_raw":0,"read":"whole","date_system":"1900"}

{"sheet":"BUD","index":0,"n_rows":75,"n_cols":68,"rows_kept":75,"cut":false,"hidden":false,"merged":[]}
["08/01/2025",null,"Sonida Senior Living, Inc",{"$nulls":36},"Run Date/Time:",{"$nulls":12},"2025-09-15T13:33:58.407","|",{"$nulls":5},"|",{"$nulls":4},"|"]
[null,null,"P&L Category Budget Variance Analysis",{"$nulls":36},"ReportId:",{"$nulls":13},"|",{"$nulls":5},"|",{"$nulls":4},"|"]
[null,null,"KDC Properties (m1618)",{"$nulls":50},"|",{"$nulls":5},"|",{"$nulls":4},"|"]
[null,null,{"$f":"\"As of \"&TEXT(EOMONTH(BN4,0),\"MMMM DD,  YYYY\")","v":"As of August 31,  2025"},{"$nulls":50},"|",{"$nulls":5},"|",{"$nulls":4},"|","08/01/2025"]
[null,null,null,"Actual","Budget",null,null,"Actual","Budget",{"$nulls":14},"Actual",{"$nulls":12},"Budget",{"$nulls":15},"Budget","|",{"$f":"\"Q\"&ROUNDUP(MONTH(BC7)/3,0)","v":"Q3"},"Q2","Q1","Q4","Q3","|",{"$f":"BC5&\" o \"&BD5","v":"Q3 o Q2"},"Q2 o Q1","Q1 o Q4","Q4 o Q3","|"]
[null,null,null,"Month","Month","Incr(Decr)","% Incr(Decr)","Rolling QTD","Rolling QTD","Incr(Decr)","% Incr(Decr)",{"$f":"YEAR(BN4)&\"-1\"","v":"2025-1"},{"$f":"YEAR(BN4)&\"-2\"","v":"2025-2"},{"$f":"YEAR(BN4)&\"-3\"","v":"2025-3"},{"$f":"YEAR(BN4)&\"-4\"","v":"2025-4"},{"$f":"YEAR(BN4)&\"-5\"","v":"2025-5"},{"$f":"YEAR(BN4)&\"-6\"","v":"2025-6"},{"$f":"YEAR(BN4)&\"-7\"","v":"2025-7"},{"$f":"YEAR(BN4)&\"-8\"","v":"2025-8"},{"$f":"YEAR(BN4)&\"-9\"","v":"2025-9"},{"$f":"YEAR(BN4)&\"-10\"","v":"2025-10"},{"$f":"YEAR(BN4)&\"-11\"","v":"2025-11"},{"$f":"YEAR(BN4)&\"-12\"","v":"2025-12"},"YTD",{"$f":"YEAR(BN4)&\"-1\"","v":"2025-1"},{"$f":"YEAR(BN4)&\"-2\"","v":"2025-2"},{"$f":"YEAR(BN4)&\"-3\"","v":"2025-3"},{"$f":"YEAR(BN4)&\"-4\"","v":"2025-4"},{"$f":"YEAR(BN4)&\"-5\"","v":"2025-5"},{"$f":"YEAR(BN4)&\"-6\"","v":"2025-6"},{"$f":"YEAR(BN4)&\"-7\"","v":"2025-7"},{"$f":"YEAR(BN4)&\"-8\"","v":"2025-8"},{"$f":"YEAR(BN4)&\"-9\"","v":"2025-9"},{"$f":"YEAR(BN4)&\"-10\"","v":"2025-10"},{"$f":"YEAR(BN4)&\"-11\"","v":"2025-11"},{"$f":"YEAR(BN4)&\"-12\"","v":"2025-12"},"YTD","Incr(Decr)","% Incr(Decr)",null,{"$f":"YEAR(BN4)&\"-1\"","v":"2025-1"},{"$f":"YEAR(BN4)&\"-2\"","v":"2025-2"},{"$f":"YEAR(BN4)&\"-3\"","v":"2025-3"},{"$f":"YEAR(BN4)&\"-4\"","v":"2025-4"},{"$f":"YEAR(BN4)&\"-5\"","v":"2025-5"},{"$f":"YEAR(BN4)&\"-6\"","v":"2025-6"},{"$f":"YEAR(BN4)&\"-7\"","v":"2025-7"},{"$f":"YEAR(BN4)&\"-8\"","v":"2025-8"},{"$f":"YEAR(BN4)&\"-9\"","v":"2025-9"},{"$f":"YEAR(BN4)&\"-10\"","v":"2025-10"},{"$f":"YEAR(BN4)&\"-11\"","v":"2025-11"},{"$f":"YEAR(BN4)&\"-12\"","v":"2025-12"},"Annual","|","Rolling QTD","Rolling QTD","Rolling QTD","Rolling QTD","Rolling QTD","|","% Incr(Decr)","% Incr(Decr)","% Incr(Decr)","% Incr(Decr)","|"]
[null,null,"Month-Year","Aug-25","Aug-25",null,null,"Aug-25","Aug-25",null,null,1.0,2.0,3.0,4.0,5.0,6.0,7.0,8.0,9.0,10.0,11.0,12.0,null,1.0,2.0,3.0,4.0,5.0,6.0,7.0,8.0,9.0,10.0,11.0,12.0,"Aug-25",null,null,null,1.0,2.0,3.0,4.0,5.0,6.0,7.0,8.0,9.0,10.0,11.0,12.0,{"$f":"YEAR(BN4)&\"-12\"","v":"2025-12"},"|","Aug-25","May-25","Feb-25","Nov-24","Aug-24","|",{"$nulls":4},"|"]
[null,null,"Units Occupied",null,null,{"$f":"D8-E8","v":0},{"$f":"IFERROR(F8/E8,0)","v":0},null,null,{"$f":"H8-I8","v":0},{"$f":"IFERROR(J8/I8,0)","v":0},{"$f":"IF(L7>MONTH($BN$4),\"\",HLOOKUP($L$7,CPL!$E$5:$P$50,ROW()-4,0))","v":""},{"$f":"IF(M7>MONTH($BN$4),\"\",HLOOKUP($M$7,CPL!$E$5:$P$50,ROW()-4,0))","v":""},{"$f":"IF(N7>MONTH($BN$4),\"\",HLOOKUP($N$7,CPL!$E$5:$P$50,ROW()-4,0))","v":""},{"$f":"IF(O7>MONTH($BN$4),\"\",HLOOKUP($O$7,CPL!$E$5:$P$50,ROW()-4,0))","v":""},{"$f":"IF(P7>MONTH($BN$4),\"\",HLOOKUP($P$7,CPL!$E$5:$P$50,ROW()-4,0))","v":""},{"$f":"IF(Q7>MONTH($BN$4),\"\",HLOOKUP($Q$7,CPL!$E$5:$P$50,ROW()-4,0))","v":""},{"$f":"IF(R7>MONTH($BN$4),\"\",HLOOKUP($R$7,CPL!$E$5:$P$50,ROW()-4,0))","v":""},{"$f":"IF(S7>MONTH($BN$4),\"\",HLOOKUP($S$7,CPL!$E$5:$P$50,ROW()-4,0))","v":""},{"$f":"IF(T7>MONTH($BN$4),\"\",HLOOKUP($T$7,CPL!$E$5:$P$50,ROW()-4,0))","v":""},{"$f":"IF(U7>MONTH($BN$4),\"\",HLOOKUP($U$7,CPL!$E$5:$P$50,ROW()-4,0))","v":""},{"$f":"IF(V7>MONTH($BN$4),\"\",HLOOKUP($V$7,CPL!$E$5:$P$50,ROW()-4,0))","v":""},{"$f":"IF(W7>MONTH($BN$4),\"\",HLOOKUP($W$7,CPL!$E$5:$P$50,ROW()-4,0))","v":""},null,{"$f":"IF(Y7>MONTH($BN$4),\"\",AO8)","v":""},"","","","","","","","","","","",null,{"$f":"X8-AK8","v":0},{"$f":"IFERROR(AL8/AK8,0)","v":0},{"$nulls":14},{"$f":"\"|\"","v":"|"},{"$nulls":5},{"$f":"\"|\"","v":"|"},{"$f":"IFERROR(IF(BG8<=0,-(BG8-BD8)/BD8,(BG8-BD8)/BD8),0)","v":0},{"$f":"IFERROR(IF(BD8<=0,-(BD8-BE8)/BE8,(BD8-BE8)/BE8),0)","v":0},0,0,{"$f":"\"|\"","v":"|"},"H"]
[null,null,"   Independent Living Occupied",11.9032,11.0,0.9032,0.08210909091,11.688166,11.0,0.688166,0.06256054545,{"$f":"IF(L7>MONTH($BN$4),\"\",HLOOKUP($L$7,CPL!$E$5:$P$50,ROW()-4,0))","v":12.0323},{"$f":"IF(M7>MONTH($BN$4),\"\",HLOOKUP($M$7,CPL!$E$5:$P$50,ROW()-4,0))","v":12},{"$f":"IF(N7>MONTH($BN$4),\"\",HLOOKUP($N$7,CPL!$E$5:$P$50,ROW()-4,0))","v":12},{"$f":"IF(O7>MONTH($BN$4),\"\",HLOOKUP($O$7,CPL!$E$5:$P$50,ROW()-4,0))","v":12},{"$f":"IF(P7>MONTH($BN$4),\"\",HLOOKUP($P$7,CPL!$E$5:$P$50,ROW()-4,0))","v":12},{"$f":"IF(Q7>MONTH($BN$4),\"\",HLOOKUP($Q$7,CPL!$E$5:$P$50,ROW()-4,0))","v":12},{"$f":"IF(R7>MONTH($BN$4),\"\",HLOOKUP($R$7,CPL!$E$5:$P$50,ROW()-4,0))","v":11.1613},{"$f":"IF(S7>MONTH($BN$4),\"\",HLOOKUP($S$7,CPL!$E$5:$P$50,ROW()-4,0))","v":11.9032},{"$f":"IF(T7>MONTH($BN$4),\"\",HLOOKUP($T$7,CPL!$E$5:$P$50,ROW()-4,0))","v":""},{"$f":"IF(U7>MONTH($BN$4),\"\",HLOOKUP($U$7,CPL!$E$5:$P$50,ROW()-4,0))","v":""},{"$f":"IF(V7>MONTH($BN$4),\"\",HLOOKUP($V$7,CPL!$E$5:$P$50,ROW()-4,0))","v":""},{"$f":"IF(W7>MONTH($BN$4),\"\",HLOOKUP($W$7,CPL!$E$5:$P$50,ROW()-4,0))","v":""},11.8871,{"$f":"IF(Y7>MONTH($BN$4),\"\",AO9)","v":11},11,11,11,11,11,11,11,"","","","",11.0,0.8871,0.08064545455,null,11.0,11.0,11.0,11.0,11.0,11.0,11.0,11.0,11.0,11.0,11.0,11.0,11.0,"|",11.688166,12.0,12.010766,11.505366,10.268833,"|",-0.1442639167,{"$f":"IFERROR(IF(BD9<=0,-(BD9-BE9)/BE9,(BD9-BE9)/BE9),0)","v":-0.0008963624801},0.04392732921,0.1204161174,"|","R"]
[null,null,"   Assisted Living Occupied",0.0,0.0,0,0,0.0,0.0,0,0,{"$f":"IF(L7>MONTH($BN$4),\"\",HLOOKUP($L$7,CPL!$E$5:$P$50,ROW()-4,0))","v":0},{"$f":"IF(M7>MONTH($BN$4),\"\",HLOOKUP($M$7,CPL!$E$5:$P$50,ROW()-4,0))","v":0},{"$f":"IF(N7>MONTH($BN$4),\"\",HLOOKUP($N$7,CPL!$E$5:$P$50,ROW()-4,0))","v":0},{"$f":"IF(O7>MONTH($BN$4),\"\",HLOOKUP($O$7,CPL!$E$5:$P$50,ROW()-4,0))","v":0},{"$f":"IF(P7>MONTH($BN$4),\"\",HLOOKUP($P$7,CPL!$E$5:$P$50,ROW()-4,0))","v":0},{"$f":"IF(Q7>MONTH($BN$4),\"\",HLOOKUP($Q$7,CPL!$E$5:$P$50,ROW()-4,0))","v":0},{"$f":"IF(R7>MONTH($BN$4),\"\",HLOOKUP($R$7,CPL!$E$5:$P$50,ROW()-4,0))","v":0},{"$f":"IF(S7>MONTH($BN$4),\"\",HLOOKUP($S$7,CPL!$E$5:$P$50,ROW()-4,0))","v":0},{"$f":"IF(T7>MONTH($BN$4),\"\",HLOOKUP($T$7,CPL!$E$5:$P$50,ROW()-4,0))","v":""},{"$f":"IF(U7>MONTH($BN$4),\"\",HLOOKUP($U$7,CPL!$E$5:$P$50,ROW()-4,0))","v":""},{"$f":"IF(V7>MONTH($BN$4),\"\",HLOOKUP($V$7,CPL!$E$5:$P$50,ROW()-4,0))","v":""},{"$f":"IF(W7>MONTH($BN$4),\"\",HLOOKUP($W$7,CPL!$E$5:$P$50,ROW()-4,0))","v":""},0.0,{"$f":"IF(Y7>MONTH($BN$4),\"\",AO10)","v":0},0,0,0,0,0,0,0,"","","","",0.0,0,0,null,0.0,0.0,0.0,0.0,0.0,0.0,0.0,0.0,0.0,0.0,0.0,0.0,0.0,"|",0.0,0.0,0.0,0.0,0.0,"|",0,{"$f":"IFERROR(IF(BD10<=0,-(BD10-BE10)/BE10,(BD10-BE10)/BE10),0)","v":0},0,0,"|","R"]
[null,null,"   Memory Care Occupied",0.0,0.0,0,0,0.0,0.0,0,0,{"$f":"IF(L7>MONTH($BN$4),\"\",HLOOKUP($L$7,CPL!$E$5:$P$50,ROW()-4,0))","v":0},{"$f":"IF(M7>MONTH($BN$4),\"\",HLOOKUP($M$7,CPL!$E$5:$P$50,ROW()-4,0))","v":0},{"$f":"IF(N7>MONTH($BN$4),\"\",HLOOKUP($N$7,CPL!$E$5:$P$50,ROW()-4,0))","v":0},{"$f":"IF(O7>MONTH($BN$4),\"\",HLOOKUP($O$7,CPL!$E$5:$P$50,ROW()-4,0))","v":0},{"$f":"IF(P7>MONTH($BN$4),\"\",HLOOKUP($P$7,CPL!$E$5:$P$50,ROW()-4,0))","v":0},{"$f":"IF(Q7>MONTH($BN$4),\"\",HLOOKUP($Q$7,CPL!$E$5:$P$50,ROW()-4,0))","v":0},{"$f":"IF(R7>MONTH($BN$4),\"\",HLOOKUP($R$7,CPL!$E$5:$P$50,ROW()-4,0))","v":0},{"$f":"IF(S7>MONTH($BN$4),\"\",HLOOKUP($S$7,CPL!$E$5:$P$50,ROW()-4,0))","v":0},{"$f":"IF(T7>MONTH($BN$4),\"\",HLOOKUP($T$7,CPL!$E$5:$P$50,ROW()-4,0))","v":""},{"$f":"IF(U7>MONTH($BN$4),\"\",HLOOKUP($U$7,CPL!$E$5:$P$50,ROW()-4,0))","v":""},{"$f":"IF(V7>MONTH($BN$4),\"\",HLOOKUP($V$7,CPL!$E$5:$P$50,ROW()-4,0))","v":""},{"$f":"IF(W7>MONTH($BN$4),\"\",HLOOKUP($W$7,CPL!$E$5:$P$50,ROW()-4,0))","v":""},0.0,{"$f":"IF(Y7>MONTH($BN$4),\"\",AO11)","v":0},0,0,0,0,0,0,0,"","","","",0.0,0,0,null,0.0,0.0,0.0,0.0,0.0,0.0,0.0,0.0,0.0,0.0,0.0,0.0,0.0,"|",0.0,0.0,0.0,0.0,0.0,"|",0,{"$f":"IFERROR(IF(BD11<=0,-(BD11-BE11)/BE11,(BD11-BE11)/BE11),0)","v":0},0,0,"|","R"]
[null,null,"      Total Units Occupied",11.9032,11.0,0.9032,0.08210909091,11.688166,11.0,0.688166,0.06256054545,{"$f":"IF(L7>MONTH($BN$4),\"\",HLOOKUP($L$7,CPL!$E$5:$P$50,ROW()-4,0))","v":12.0323},{"$f":"IF(M7>MONTH($BN$4),\"\",HLOOKUP($M$7,CPL!$E$5:$P$50,ROW()-4,0))","v":12},{"$f":"IF(N7>MONTH($BN$4),\"\",HLOOKUP($N$7,CPL!$E$5:$P$50,ROW()-4,0))","v":12},{"$f":"IF(O7>MONTH($BN$4),\"\",HLOOKUP($O$7,CPL!$E$5:$P$50,ROW()-4,0))","v":12},{"$f":"IF(P7>MONTH($BN$4),\"\",HLOOKUP($P$7,CPL!$E$5:$P$50,ROW()-4,0))","v":12},{"$f":"IF(Q7>MONTH($BN$4),\"\",HLOOKUP($Q$7,CPL!$E$5:$P$50,ROW()-4,0))","v":12},{"$f":"IF(R7>MONTH($BN$4),\"\",HLOOKUP($R$7,CPL!$E$5:$P$50,ROW()-4,0))","v":11.1613},{"$f":"IF(S7>MONTH($BN$4),\"\",HLOOKUP($S$7,CPL!$E$5:$P$50,ROW()-4,0))","v":11.9032},{"$f":"IF(T7>MONTH($BN$4),\"\",HLOOKUP($T$7,CPL!$E$5:$P$50,ROW()-4,0))","v":""},{"$f":"IF(U7>MONTH($BN$4),\"\",HLOOKUP($U$7,CPL!$E$5:$P$50,ROW()-4,0))","v":""},{"$f":"IF(V7>MONTH($BN$4),\"\",HLOOKUP($V$7,CPL!$E$5:$P$50,ROW()-4,0))","v":""},{"$f":"IF(W7>MONTH($BN$4),\"\",HLOOKUP($W$7,CPL!$E$5:$P$50,ROW()-4,0))","v":""},11.8871,{"$f":"IF(Y7>MONTH($BN$4),\"\",AO12)","v":11},11,11,11,11,11,11,11,"","","","",11.0,0.8871,0.08064545455,null,11.0,11.0,11.0,11.0,11.0,11.0,11.0,11.0,11.0,11.0,11.0,11.0,11.0,"|",11.688166,12.0,12.010766,11.505366,10.268833,"|",-0.1442639167,{"$f":"IFERROR(IF(BD12<=0,-(BD12-BE12)/BE12,(BD12-BE12)/BE12),0)","v":-0.0008963624801},0.04392732921,0.1204161174,"|","T"]
[null,null,"Units Available",null,null,0,0,null,null,0,0,{"$f":"IF(L7>MONTH($BN$4),\"\",HLOOKUP($L$7,CPL!$E$5:$P$50,ROW()-4,0))","v":""},{"$f":"IF(M7>MONTH($BN$4),\"\",HLOOKUP($M$7,CPL!$E$5:$P$50,ROW()-4,0))","v":""},{"$f":"IF(N7>MONTH($BN$4),\"\",HLOOKUP($N$7,CPL!$E$5:$P$50,ROW()-4,0))","v":""},{"$f":"IF(O7>MONTH($BN$4),\"\",HLOOKUP($O$7,CPL!$E$5:$P$50,ROW()-4,0))","v":""},{"$f":"IF(P7>MONTH($BN$4),\"\",HLOOKUP($P$7,CPL!$E$5:$P$50,ROW()-4,0))","v":""},{"$f":"IF(Q7>MONTH($BN$4),\"\",HLOOKUP($Q$7,CPL!$E$5:$P$50,ROW()-4,0))","v":""},{"$f":"IF(R7>MONTH($BN$4),\"\",HLOOKUP($R$7,CPL!$E$5:$P$50,ROW()-4,0))","v":""},{"$f":"IF(S7>MONTH($BN$4),\"\",HLOOKUP($S$7,CPL!$E$5:$P$50,ROW()-4,0))","v":""},{"$f":"IF(T7>MONTH($BN$4),\"\",HLOOKUP($T$7,CPL!$E$5:$P$50,ROW()-4,0))","v":""},{"$f":"IF(U7>MONTH($BN$4),\"\",HLOOKUP($U$7,CPL!$E$5:$P$50,ROW()-4,0))","v":""},{"$f":"IF(V7>MONTH($BN$4),\"\",HLOOKUP($V$7,CPL!$E$5:$P$50,ROW()-4,0))","v":""},{"$f":"IF(W7>MONTH($BN$4),\"\",HLOOKUP($W$7,CPL!$E$5:$P$50,ROW()-4,0))","v":""},null,{"$f":"IF(Y7>MONTH($BN$4),\"\",AO13)","v":""},"","","","","","","","","","","",null,0,0,{"$nulls":14},"|",{"$nulls":5},"|",0,{"$f":"IFERROR(IF(BD13<=0,-(BD13-BE13)/BE13,(BD13-BE13)/BE13),0)","v":0},0,0,"|","H"]
[null,null,"   Independent Living Available",12.0,12.0,0,0,12.0,12.0,0,0,{"$f":"IF(L7>MONTH($BN$4),\"\",HLOOKUP($L$7,CPL!$E$5:$P$50,ROW()-4,0))","v":12},{"$f":"IF(M7>MONTH($BN$4),\"\",HLOOKUP($M$7,CPL!$E$5:$P$50,ROW()-4,0))","v":12},{"$f":"IF(N7>MONTH($BN$4),\"\",HLOOKUP($N$7,CPL!$E$5:$P$50,ROW()-4,0))","v":12},{"$f":"IF(O7>MONTH($BN$4),\"\",HLOOKUP($O$7,CPL!$E$5:$P$50,ROW()-4,0))","v":12},{"$f":"IF(P7>MONTH($BN$4),\"\",HLOOKUP($P$7,CPL!$E$5:$P$50,ROW()-4,0))","v":12},{"$f":"IF(Q7>MONTH($BN$4),\"\",HLOOKUP($Q$7,CPL!$E$5:$P$50,ROW()-4,0))","v":12},{"$f":"IF(R7>MONTH($BN$4),\"\",HLOOKUP($R$7,CPL!$E$5:$P$50,ROW()-4,0))","v":12},{"$f":"IF(S7>MONTH($BN$4),\"\",HLOOKUP($S$7,CPL!$E$5:$P$50,ROW()-4,0))","v":12},{"$f":"IF(T7>MONTH($BN$4),\"\",HLOOKUP($T$7,CPL!$E$5:$P$50,ROW()-4,0))","v":""},{"$f":"IF(U7>MONTH($BN$4),\"\",HLOOKUP($U$7,CPL!$E$5:$P$50,ROW()-4,0))","v":""},{"$f":"IF(V7>MONTH($BN$4),\"\",HLOOKUP($V$7,CPL!$E$5:$P$50,ROW()-4,0))","v":""},{"$f":"IF(W7>MONTH($BN$4),\"\",HLOOKUP($W$7,CPL!$E$5:$P$50,ROW()-4,0))","v":""},12.0,{"$f":"IF(Y7>MONTH($BN$4),\"\",AO14)","v":12},12,12,12,12,12,12,12,"","","","",12.0,0,0,null,12.0,12.0,12.0,12.0,12.0,12.0,12.0,12.0,12.0,12.0,12.0,12.0,12.0,"|",12.0,12.0,12.0,12.0,12.0,"|",0,{"$f":"IFERROR(IF(BD14<=0,-(BD14-BE14)/BE14,(BD14-BE14)/BE14),0)","v":0},0,0,"|","R"]
[null,null,"   Assisted Living Available",0.0,0.0,0,0,0.0,0.0,0,0,{"$f":"IF(L7>MONTH($BN$4),\"\",HLOOKUP($L$7,CPL!$E$5:$P$50,ROW()-4,0))","v":0},{"$f":"IF(M7>MONTH($BN$4),\"\",HLOOKUP($M$7,CPL!$E$5:$P$50,ROW()-4,0))","v":0},{"$f":"IF(N7>MONTH($BN$4),\"\",HLOOKUP($N$7,CPL!$E$5:$P$50,ROW()-4,0))","v":0},{"$f":"IF(O7>MONTH($BN$4),\"\",HLOOKUP($O$7,CPL!$E$5:$P$50,ROW()-4,0))","v":0},{"$f":"IF(P7>MONTH($BN$4),\"\",HLOOKUP($P$7,CPL!$E$5:$P$50,ROW()-4,0))","v":0},{"$f":"IF(Q7>MONTH($BN$4),\"\",HLOOKUP($Q$7,CPL!$E$5:$P$50,ROW()-4,0))","v":0},{"$f":"IF(R7>MONTH($BN$4),\"\",HLOOKUP($R$7,CPL!$E$5:$P$50,ROW()-4,0))","v":0},{"$f":"IF(S7>MONTH($BN$4),\"\",HLOOKUP($S$7,CPL!$E$5:$P$50,ROW()-4,0))","v":0},{"$f":"IF(T7>MONTH($BN$4),\"\",HLOOKUP($T$7,CPL!$E$5:$P$50,ROW()-4,0))","v":""},{"$f":"IF(U7>MONTH($BN$4),\"\",HLOOKUP($U$7,CPL!$E$5:$P$50,ROW()-4,0))","v":""},{"$f":"IF(V7>MONTH($BN$4),\"\",HLOOKUP($V$7,CPL!$E$5:$P$50,ROW()-4,0))","v":""},{"$f":"IF(W7>MONTH($BN$4),\"\",HLOOKUP($W$7,CPL!$E$5:$P$50,ROW()-4,0))","v":""},0.0,{"$f":"IF(Y7>MONTH($BN$4),\"\",AO15)","v":0},0,0,0,0,0,0,0,"","","","",0.0,0,0,null,0.0,0.0,0.0,0.0,0.0,0.0,0.0,0.0,0.0,0.0,0.0,0.0,0.0,"|",0.0,0.0,0.0,0.0,0.0,"|",0,{"$f":"IFERROR(IF(BD15<=0,-(BD15-BE15)/BE15,(BD15-BE15)/BE15),0)","v":0},0,0,"|","R"]
{"$rows_left_out":61}
{"sheet":"CAT","index":1,"n_rows":76,"n_cols":39,"rows_kept":76,"cut":false,"hidden":false,"merged":[]}
[null,null,"Sonida Senior Living, Inc",{"$nulls":18},"Run Date/Time","2025-09-15T13:33:58.407",null,"|",{"$nulls":5},"|",{"$nulls":4},"|",null,"08/01/2025"]
[null,null,"Property P&L Category Variance Analysis",{"$nulls":21},"|",{"$nulls":5},"|",{"$nulls":4},"|"]
[null,null,"KDC Properties (m1618)",{"$nulls":21},"|",{"$nulls":5},"|",{"$nulls":4},"|"]
[null,null,{"$f":"\"As of \"&TEXT(EOMONTH(AL1,0),\"MMMM DD,  YYYY\")","v":"As of August 31,  2025"},{"$nulls":21},"|",{"$nulls":5},"|",{"$nulls":4},"|"]
[null,null,null,"Current","Prior",null,null,"Current","Prior Year",null,null,"Current","Prior ",null,null,"Current","Prior Year",null,null,"Current","Prior Year",null,null,null,"|",{"$f":"\"Q\"&ROUNDUP(MONTH(Z7)/3,0)","v":"Q3"},"Q2","Q1","Q4","Q3","|",{"$f":"Z5&\" o \"&AA5","v":"Q3 o Q2"},"Q2 o Q1","Q1 o Q4","Q4 o Q3","|"]
[null,null,null,"Month","Month","Incr(Decr)","% Incr(Decr)","Month","Month","Incr(Decr)","% Incr(Decr)","Rolling QTD","Rolling QTD","Incr(Decr)","% Incr(Decr)","Rolling QTD","Rolling QTD","Incr(Decr)","% Incr(Decr)","YTD","YTD","Incr(Decr)","% Incr(Decr)",null,"|","Rolling QTD","Rolling QTD","Rolling QTD","Rolling QTD","Rolling QTD","|","% Incr(Decr)","% Incr(Decr)","% Incr(Decr)","% Incr(Decr)","|"]
[null,null,"Month-Year","Aug-25","Jul-25",null,null,"Aug-25","Aug-24",null,null,"Aug-25","May-25",null,null,"Aug-25","Aug-24",null,null,"Aug-25","Aug-24",null,null,null,"|",{"$f":"TEXT(AL1,\"MMM-YY\")","v":"Aug-25"},"May-25","Feb-25","Nov-24","Aug-24","|",{"$nulls":4},"|"]
[null,null,"Units Occupied",null,null,{"$f":"D8-E8","v":0},{"$f":"IFERROR(F8/E8,0)","v":0},null,null,{"$f":"H8-I8","v":0},{"$f":"IFERROR(J8/I8,0)","v":0},null,null,{"$f":"L8-M8","v":0},{"$f":"IFERROR(N8/M8,0)","v":0},null,null,{"$f":"P8-Q8","v":0},{"$f":"IFERROR(R8/Q8,0)","v":0},null,null,{"$f":"T8-U8","v":0},{"$f":"IFERROR(V8/U8,0)","v":0},null,{"$f":"\"|\"","v":"|"},{"$nulls":5},{"$f":"\"|\"","v":"|"},{"$f":"IFERROR(IF(Z8<=0,-(Z8-AA8)/AA8,(Z8-AA8)/AA8),0)","v":0},0,0,0,{"$f":"\"|\"","v":"|"},"H"]
[null,null,"   Independent Living Occupied",11.9032,11.1613,0.7419,0.06647075161,11.9032,10.8065,1.0967,0.1014852172,11.688166,12.0,-0.311834,-0.02598616667,11.688166,10.268833,1.419333,0.138217556,11.8871,8.248925,3.638175,0.441048379,null,"|",11.688166,12.0,12.010766,11.505366,10.268833,"|",{"$f":"IFERROR(IF(Z9<=0,-(Z9-AA9)/AA9,(Z9-AA9)/AA9),0)","v":-0.02598616667},-0.0008963624801,0.04392732921,0.1204161174,"|","R"]
[null,null,"   Assisted Living Occupied",0.0,0.0,0,0,0.0,0.0,0,0,0.0,0.0,0,0,0.0,0.0,0,0,0.0,0.0,0,0,null,"|",0.0,0.0,0.0,0.0,0.0,"|",{"$f":"IFERROR(IF(Z10<=0,-(Z10-AA10)/AA10,(Z10-AA10)/AA10),0)","v":0},0,0,0,"|","R"]
[null,null,"   Memory Care Occupied",0.0,0.0,0,0,0.0,0.0,0,0,0.0,0.0,0,0,0.0,0.0,0,0,0.0,0.0,0,0,null,"|",0.0,0.0,0.0,0.0,0.0,"|",{"$f":"IFERROR(IF(Z11<=0,-(Z11-AA11)/AA11,(Z11-AA11)/AA11),0)","v":0},0,0,0,"|","R"]
[null,null,"      Total Units Occupied",11.9032,11.1613,0.7419,0.06647075161,11.9032,10.8065,1.0967,0.1014852172,11.688166,12.0,-0.311834,-0.02598616667,11.688166,10.268833,1.419333,0.138217556,11.8871,8.248925,3.638175,0.441048379,null,"|",11.688166,12.0,12.010766,11.505366,10.268833,"|",{"$f":"IFERROR(IF(Z12<=0,-(Z12-AA12)/AA12,(Z12-AA12)/AA12),0)","v":-0.02598616667},-0.0008963624801,0.04392732921,0.1204161174,"|","T"]
[null,null,"Units Available",null,null,0,0,null,null,0,0,null,null,0,0,null,null,0,0,null,null,0,0,null,"|",{"$nulls":5},"|",{"$f":"IFERROR(IF(Z13<=0,-(Z13-AA13)/AA13,(Z13-AA13)/AA13),0)","v":0},0,0,0,"|","H"]
[null,null,"   Independent Living Available",12.0,12.0,0,0,12.0,12.0,0,0,12.0,12.0,0,0,12.0,12.0,0,0,12.0,11.629037,0.370963,0.03189971792,null,"|",12.0,12.0,12.0,12.0,12.0,"|",{"$f":"IFERROR(IF(Z14<=0,-(Z14-AA14)/AA14,(Z14-AA14)/AA14),0)","v":0},0,0,0,"|","R"]
[null,null,"   Assisted Living Available",0.0,0.0,0,0,0.0,0.0,0,0,0.0,0.0,0,0,0.0,0.0,0,0,0.0,0.0,0,0,null,"|",0.0,0.0,0.0,0.0,0.0,"|",{"$f":"IFERROR(IF(Z15<=0,-(Z15-AA15)/AA15,(Z15-AA15)/AA15),0)","v":0},0,0,0,"|","R"]
{"$rows_left_out":62}
{"sheet":"CPL","index":2,"n_rows":75,"n_cols":19,"rows_kept":75,"cut":false,"hidden":false,"merged":[]}
["08/01/2025",null,"Sonida Senior Living, Inc",{"$nulls":11},"Run Date/Time:","2025-09-15T13:33:58.407"]
[null,null,"Category P&L 13 Month Report"]
[null,null,"KDC Properties (m1618)",{"$nulls":11}," "," "]
[{"$nulls":14}," "]
[null,null,{"$f":"\"Cur Per Ending \"&TEXT(EOMONTH(A1,0),\"MMMM DD,  YYYY\")","v":"Cur Per Ending August 31,  2025"},{"$f":"MONTH(D6)","v":8},9,10,11,12,1,2,3,4,5,6,7,8]
[null,null,"Month - Year","Aug-24","Sep-24","Oct-24","Nov-24","Dec-24","Jan-25","Feb-25","Mar-25","Apr-25","May-25","Jun-25","Jul-25","Aug-25"]
[]
[null,null,"Units Occupied",{"$nulls":13},"H"]
[null,null,"   Independent Living Occupied",10.8065,11.0,11.5161,12.0,12.0,12.0323,12.0,12.0,12.0,12.0,12.0,11.1613,11.9032,"R"]
[null,null,"   Assisted Living Occupied",0.0,0.0,0.0,0.0,0.0,0.0,0.0,0.0,0.0,0.0,0.0,0.0,0.0,"R"]
[null,null,"   Memory Care Occupied",0.0,0.0,0.0,0.0,0.0,0.0,0.0,0.0,0.0,0.0,0.0,0.0,0.0,"R"]
[null,null,"      Total Units Occupied",10.8065,11.0,11.5161,12.0,12.0,12.0323,12.0,12.0,12.0,12.0,12.0,11.1613,11.9032,"T"]
[null,null,"Units Available",{"$nulls":13},"H"]
[null,null,"   Independent Living Available",12.0,12.0,12.0,12.0,12.0,12.0,12.0,12.0,12.0,12.0,12.0,12.0,12.0,"R"]
[null,null,"   Assisted Living Available",0.0,0.0,0.0,0.0,0.0,0.0,0.0,0.0,0.0,0.0,0.0,0.0,0.0,"R"]
{"$rows_left_out":61}
{"sheet":"VAR","index":3,"n_rows":39,"n_cols":11,"rows_kept":39,"cut":false,"hidden":false,"merged":[[1,2,3,9]]}
[]
[null,null,"MONTHLY OPERATING REVIEW - EXPENSE VARIANCES"]
[]
[]
[null,null,"Community Name: ","KDC Properties (m1618)",null,null,null,"Month:  ",{"$f":"TEXT(EOMONTH(K5,0),\"MMMM YYYY\")","v":"August 2025"},null,"08/01/2025"]
[]
[null,null,"Operating Expense Categories","Actuals","Budget","Variance","Variance %","Explanation","Action Plan"]
[null,null,"     Direct Labor",450.0,0.0,-450.0,{"$f":"IFERROR(F8/E8,0)","v":0}]
[null,null,"     Labor - Salary & Wages - Allocated",0.0,0.0,0.0,0]
[null,null,"     Other Labor",0.0,0.0,0.0,0]
[null,null,"     Contract/Consulting",0.0,0.0,0.0,0]
[null,null,"     Vacation",0.0,0.0,0.0,0]
[null,null,"     Bonuses",0.0,0.0,0.0,0]
[null,null,"     Payroll Taxes",0.0,0.0,0.0,0]
[null,null,"     Benefits",0.0,0.0,0.0,0]
{"$rows_left_out":25}
{"sheet":"Exec Summary","index":4,"n_rows":62,"n_cols":13,"rows_kept":62,"cut":false,"hidden":false,"merged":[[1,2,3,9],[4,3,4,6],[27,2,27,9],[28,2,28,9],[29,2,33,9],[34,2,34,9],[35,2,35,9],[45,2,45,4],[46,2,46,4],[36,2,41,9],[42,2,42,9],[43,2,43,4],[43,5,43,9],[44,2,44,4],[44,5,44,9],[45,5,45,9],[53,2,53,4],[54,2,54,4],[55,2,55,4],[54,5,54,9],[55,5,55,9],[56,2,56,9],[57,2,59,9],[60,2,60,9],[61,2,61,9],[62,2,65,9],[46,5,46,9],[47,2,47,9],[48,2,50,9],[51,2,51,9],[52,2,52,4],[52,5,52,9],[53,5,53,9]]}
[]
[null,null,"MONTHLY OPERATING REVIEW - EXECUTIVE SUMMARY"]
[]
[]
[null,null,"Community Name: ","KDC Properties (m1618)",{"$nulls":4},"Month:  ",{"$f":"TEXT(L5,\"MMMM YYYY\")","v":"August 2025"},null,"08/01/2025"]
[]
[null,null,null,"Current Month","Budget","Difference","Prior Month","Difference","Prior Year Month","Difference"]
[null,null,"Occupancy %",0.991933,0.916666,{"$f":"+D8-E8","v":0.075267},0.930108,{"$f":"+D8-G8","v":0.061825},0.900541,{"$f":"+D8-I8","v":0.091392}]
[null,null,"Avg Rent",3164.18106,0.0,3164.18106,3221.326368,-57.145308,3042.315273,121.865787]
[null,null,"Revenue",{"$f":"VLOOKUP(\"Total Revenue\",BUD!$C$1:$D$999,2,0)","v":37663.88},{"$f":"VLOOKUP(\"Total Revenue\",BUD!$C$1:$E$999,3,0)","v":0},37663.88,{"$f":"VLOOKUP(\"Total Revenue\",CAT!$C$1:$E$999,3,0)","v":35954.19},1709.69,{"$f":"VLOOKUP(\"Total Revenue\",CAT!$C$1:$I$999,7,0)","v":32876.78},4787.1]
[null,null,"Operating Expense",{"$f":"VLOOKUP(\"Total Operating Expenses\",BUD!$C$1:$D$999,2,0)","v":5627.77},{"$f":"VLOOKUP(\"Total Operating Expenses\",BUD!$C$1:$E$999,3,0)","v":0},5627.77,{"$f":"VLOOKUP(\"Total Operating Expenses\",CAT!$C$1:$E$999,3,0)","v":5820},-192.23,{"$f":"VLOOKUP(\"Total Operating Expenses\",CAT!$C$1:$I$999,7,0)","v":9262.5},-3634.73,null,null,"`"]
[null,null,"NOI",{"$f":"VLOOKUP(\"Net Operating Income(Loss)\",BUD!$C$1:$D$999,2,0)","v":32036.11},{"$f":"VLOOKUP(\"Net Operating Income(Loss)\",BUD!$C$1:$E$999,3,0)","v":0},32036.11,{"$f":"VLOOKUP(\"Net Operating Income(Loss)\",CAT!$C$1:$E$999,3,0)","v":30134.19},1901.92,{"$f":"VLOOKUP(\"Net Operating Income(Loss)\",CAT!$C$1:$I$999,7,0)","v":23614.28},8421.83]
[null,null,"NOI %",{"$f":"IFERROR(D12/D10,0)","v":0.8505791225},0,0.8505791225,{"$f":"IFERROR(G12/G10,0)","v":0.8381273504},0.0124517721,{"$f":"IFERROR(I12/I10,0)","v":0.7182662049},0.1323129176]
[]
[null,null,null,"YTD","Budget","Difference","Prior YTD","Difference"]
{"$rows_left_out":47}